From ALIUM, 1 Month ago, written in Plain Text.
This paste will go to its last resting place in 9 Months.
Embed
  1. ==> Spouští se prepare()...
  2. patching file include/spdlog/fmt/bundled/LICENSE.rst
  3. patching file include/spdlog/fmt/bundled/chrono.h
  4. patching file include/spdlog/fmt/bundled/color.h
  5. patching file include/spdlog/fmt/bundled/compile.h
  6. patching file include/spdlog/fmt/bundled/core.h
  7. patching file include/spdlog/fmt/bundled/format-inl.h
  8. patching file include/spdlog/fmt/bundled/format.h
  9. patching file include/spdlog/fmt/bundled/locale.h
  10. patching file include/spdlog/fmt/bundled/ostream.h
  11. patching file include/spdlog/fmt/bundled/posix.h
  12. patching file include/spdlog/fmt/bundled/printf.h
  13. patching file include/spdlog/fmt/bundled/ranges.h
  14. patching file include/spdlog/fmt/bundled/safe-duration-cast.h
  15. patching file include/spdlog/fmt/bundled/time.h
  16. ==> Odstraňuje se existující adresář $pkgdir/ ...
  17. ==> Spouští se build()...
  18. -- The CXX compiler identification is GNU 9.1.0
  19. -- Check for working CXX compiler: /bin/c++
  20. -- Check for working CXX compiler: /bin/c++ -- works
  21. -- Detecting CXX compiler ABI info
  22. -- Detecting CXX compiler ABI info - done
  23. -- Detecting CXX compile features
  24. -- Detecting CXX compile features - done
  25. -- Build type: Release
  26. -- Looking for C++ include pthread.h
  27. -- Looking for C++ include pthread.h - found
  28. -- Performing Test CMAKE_HAVE_LIBC_PTHREAD
  29. -- Performing Test CMAKE_HAVE_LIBC_PTHREAD - Failed
  30. -- Looking for pthread_create in pthreads
  31. -- Looking for pthread_create in pthreads - not found
  32. -- Looking for pthread_create in pthread
  33. -- Looking for pthread_create in pthread - found
  34. -- Found Threads: TRUE  
  35. -- Configuring done
  36. -- Generating done
  37. -- Build files have been written to: /tmp/makepkg/spdlog/src/build
  38. Scanning dependencies of target spdlog-utests
  39. [ 15%] Building CXX object tests/CMakeFiles/spdlog-utests.dir/test_file_helper.cpp.o
  40. [ 15%] Building CXX object tests/CMakeFiles/spdlog-utests.dir/test_errors.cpp.o
  41. [ 23%] Building CXX object tests/CMakeFiles/spdlog-utests.dir/test_misc.cpp.o
  42. [ 30%] Building CXX object tests/CMakeFiles/spdlog-utests.dir/test_file_logging.cpp.o
  43. In file included from /tmp/makepkg/spdlog/src/spdlog-1.3.1/include/spdlog/async_logger.h:73,
  44.                  from /tmp/makepkg/spdlog/src/spdlog-1.3.1/include/spdlog/async.h:20,
  45.                  from /tmp/makepkg/spdlog/src/spdlog-1.3.1/tests/includes.h:17,
  46.                  from /tmp/makepkg/spdlog/src/spdlog-1.3.1/tests/test_errors.cpp:4:
  47. /tmp/makepkg/spdlog/src/spdlog-1.3.1/include/spdlog/details/async_logger_impl.h: In member function ‘virtual std::shared_ptr<spdlog::logger> spdlog::async_logger::clone(std::string)’:
  48. /tmp/makepkg/spdlog/src/spdlog-1.3.1/include/spdlog/details/async_logger_impl.h:109:21: warning: redundant move in return statement [-Wredundant-move]
  49.   109 |     return std::move(cloned);
  50.       |            ~~~~~~~~~^~~~~~~~
  51. /tmp/makepkg/spdlog/src/spdlog-1.3.1/include/spdlog/details/async_logger_impl.h:109:21: note: remove ‘std::move’ call
  52. In file included from /tmp/makepkg/spdlog/src/spdlog-1.3.1/include/spdlog/async_logger.h:73,
  53.                  from /tmp/makepkg/spdlog/src/spdlog-1.3.1/include/spdlog/async.h:20,
  54.                  from /tmp/makepkg/spdlog/src/spdlog-1.3.1/tests/includes.h:17,
  55.                  from /tmp/makepkg/spdlog/src/spdlog-1.3.1/tests/test_file_helper.cpp:4:
  56. /tmp/makepkg/spdlog/src/spdlog-1.3.1/include/spdlog/details/async_logger_impl.h: In member function ‘virtual std::shared_ptr<spdlog::logger> spdlog::async_logger::clone(std::string)’:
  57. /tmp/makepkg/spdlog/src/spdlog-1.3.1/include/spdlog/details/async_logger_impl.h:109:21: warning: redundant move in return statement [-Wredundant-move]
  58.   109 |     return std::move(cloned);
  59.       |            ~~~~~~~~~^~~~~~~~
  60. /tmp/makepkg/spdlog/src/spdlog-1.3.1/include/spdlog/details/async_logger_impl.h:109:21: note: remove ‘std::move’ call
  61. In file included from /tmp/makepkg/spdlog/src/spdlog-1.3.1/include/spdlog/async_logger.h:73,
  62.                  from /tmp/makepkg/spdlog/src/spdlog-1.3.1/include/spdlog/async.h:20,
  63.                  from /tmp/makepkg/spdlog/src/spdlog-1.3.1/tests/includes.h:17,
  64.                  from /tmp/makepkg/spdlog/src/spdlog-1.3.1/tests/test_file_logging.cpp:4:
  65. /tmp/makepkg/spdlog/src/spdlog-1.3.1/include/spdlog/details/async_logger_impl.h: In member function ‘virtual std::shared_ptr<spdlog::logger> spdlog::async_logger::clone(std::string)’:
  66. /tmp/makepkg/spdlog/src/spdlog-1.3.1/include/spdlog/details/async_logger_impl.h:109:21: warning: redundant move in return statement [-Wredundant-move]
  67.   109 |     return std::move(cloned);
  68.       |            ~~~~~~~~~^~~~~~~~
  69. /tmp/makepkg/spdlog/src/spdlog-1.3.1/include/spdlog/details/async_logger_impl.h:109:21: note: remove ‘std::move’ call
  70. In file included from /tmp/makepkg/spdlog/src/spdlog-1.3.1/include/spdlog/async_logger.h:73,
  71.                  from /tmp/makepkg/spdlog/src/spdlog-1.3.1/include/spdlog/async.h:20,
  72.                  from /tmp/makepkg/spdlog/src/spdlog-1.3.1/tests/includes.h:17,
  73.                  from /tmp/makepkg/spdlog/src/spdlog-1.3.1/tests/test_misc.cpp:1:
  74. /tmp/makepkg/spdlog/src/spdlog-1.3.1/include/spdlog/details/async_logger_impl.h: In member function ‘virtual std::shared_ptr<spdlog::logger> spdlog::async_logger::clone(std::string)’:
  75. /tmp/makepkg/spdlog/src/spdlog-1.3.1/include/spdlog/details/async_logger_impl.h:109:21: warning: redundant move in return statement [-Wredundant-move]
  76.   109 |     return std::move(cloned);
  77.       |            ~~~~~~~~~^~~~~~~~
  78. /tmp/makepkg/spdlog/src/spdlog-1.3.1/include/spdlog/details/async_logger_impl.h:109:21: note: remove ‘std::move’ call
  79. In file included from /tmp/makepkg/spdlog/src/spdlog-1.3.1/tests/test_misc.cpp:138:
  80. /tmp/makepkg/spdlog/src/spdlog-1.3.1/include/spdlog/fmt/bin_to_hex.h: In instantiation of ‘decltype (ctx.out()) fmt::v6::formatter<spdlog::details::bytes_range<It> >::format(const spdlog::details::bytes_range<Container>&, FormatContext&) [with FormatContext = fmt::v6::basic_format_context<std::back_insert_iterator<fmt::v6::internal::buffer<char> >, char>; Container = __gnu_cxx::__normal_iterator<const unsigned char*, std::vector<unsigned char> >; T = __gnu_cxx::__normal_iterator<const unsigned char*, std::vector<unsigned char> >; decltype (ctx.out()) = std::back_insert_iterator<fmt::v6::internal::buffer<char> >]’:
  81. /usr/include/fmt/core.h:740:5:   required from ‘static void fmt::v6::internal::value<Context>::format_custom_arg(const void*, fmt::v6::basic_parse_context<typename Context::char_type>&, Context&) [with T = spdlog::details::bytes_range<__gnu_cxx::__normal_iterator<const unsigned char*, std::vector<unsigned char> > >; Formatter = fmt::v6::formatter<spdlog::details::bytes_range<__gnu_cxx::__normal_iterator<const unsigned char*, std::vector<unsigned char> > >, char, void>; Context = fmt::v6::basic_format_context<std::back_insert_iterator<fmt::v6::internal::buffer<char> >, char>; typename Context::char_type = char]’
  82. /usr/include/fmt/core.h:724:19:   required from ‘fmt::v6::internal::value<Context>::value(const T&) [with T = spdlog::details::bytes_range<__gnu_cxx::__normal_iterator<const unsigned char*, std::vector<unsigned char> > >; Context = fmt::v6::basic_format_context<std::back_insert_iterator<fmt::v6::internal::buffer<char> >, char>]’
  83. /usr/include/fmt/core.h:1015:39:   required from ‘fmt::v6::internal::value<Context> fmt::v6::internal::make_arg(const T&) [with bool IS_PACKED = true; Context = fmt::v6::basic_format_context<std::back_insert_iterator<fmt::v6::internal::buffer<char> >, char>; T = spdlog::details::bytes_range<__gnu_cxx::__normal_iterator<const unsigned char*, std::vector<unsigned char> > >; typename std::enable_if<IS_PACKED, int>::type <anonymous> = 0]’
  84. /usr/include/fmt/core.h:1106:53:   required from ‘fmt::v6::format_arg_store<Context, Args>::format_arg_store(const Args& ...) [with Context = fmt::v6::basic_format_context<std::back_insert_iterator<fmt::v6::internal::buffer<char> >, char>; Args = {spdlog::details::bytes_range<__gnu_cxx::__normal_iterator<const unsigned char*, std::vector<unsigned char, std::allocator<unsigned char> > > >}]’
  85. /usr/include/fmt/core.h:1120:18:   required from ‘fmt::v6::format_arg_store<Context, Args ...> fmt::v6::make_format_args(const Args& ...) [with Context = fmt::v6::basic_format_context<std::back_insert_iterator<fmt::v6::internal::buffer<char> >, char>; Args = {spdlog::details::bytes_range<__gnu_cxx::__normal_iterator<const unsigned char*, std::vector<unsigned char, std::allocator<unsigned char> > > >}]’
  86. /usr/include/fmt/format.h:3347:57:   required from ‘typename fmt::v6::buffer_context<Char>::iterator fmt::v6::format_to(fmt::v6::basic_memory_buffer<Char, SIZE>&, const S&, Args&& ...) [with S = const char*; Args = {const spdlog::details::bytes_range<__gnu_cxx::__normal_iterator<const unsigned char*, std::vector<unsigned char, std::allocator<unsigned char> > > >&}; long unsigned int SIZE = 500; Char = char; typename fmt::v6::buffer_context<Char>::iterator = std::back_insert_iterator<fmt::v6::internal::buffer<char> >]’
  87. /tmp/makepkg/spdlog/src/spdlog-1.3.1/include/spdlog/details/logger_impl.h:72:23:   required from ‘void spdlog::logger::log(spdlog::source_loc, spdlog::level::level_enum, const char*, const Args& ...) [with Args = {spdlog::details::bytes_range<__gnu_cxx::__normal_iterator<const unsigned char*, std::vector<unsigned char, std::allocator<unsigned char> > > >}]’
  88. /tmp/makepkg/spdlog/src/spdlog-1.3.1/include/spdlog/details/logger_impl.h:82:5:   required from ‘void spdlog::logger::log(spdlog::level::level_enum, const char*, const Args& ...) [with Args = {spdlog::details::bytes_range<__gnu_cxx::__normal_iterator<const unsigned char*, std::vector<unsigned char, std::allocator<unsigned char> > > >}]’
  89. /tmp/makepkg/spdlog/src/spdlog-1.3.1/include/spdlog/details/logger_impl.h:165:5:   required from ‘void spdlog::logger::info(const char*, const Args& ...) [with Args = {spdlog::details::bytes_range<__gnu_cxx::__normal_iterator<const unsigned char*, std::vector<unsigned char, std::allocator<unsigned char> > > >}]’
  90. /tmp/makepkg/spdlog/src/spdlog-1.3.1/tests/test_misc.cpp:147:44:   required from here
  91. /tmp/makepkg/spdlog/src/spdlog-1.3.1/include/spdlog/fmt/bin_to_hex.h:120:29: error: ‘class fmt::v6::basic_format_context<std::back_insert_iterator<fmt::v6::internal::buffer<char> >, char>’ has no member named ‘begin’
  92.   120 |         auto inserter = ctx.begin();
  93.       |                         ~~~~^~~~~
  94. compilation terminated due to -Wfatal-errors.
  95. make[2]: *** [tests/CMakeFiles/spdlog-utests.dir/build.make:102: tests/CMakeFiles/spdlog-utests.dir/test_misc.cpp.o] Chyba 1
  96. make[2]: *** Čeká se na nedokončené úlohy…
  97. ^Cmake[2]: *** wait: Žádný potomek neexistuje. Konec.
  98. make[1]: *** [CMakeFiles/Makefile2:906: tests/CMakeFiles/spdlog-utests.dir/all] Chyba 2
  99. make: *** [Makefile:141: all] Přerušení (SIGINT)
  100.  
  101. ==> CHYBA: Aborted by user! Exiting...
  102.  
  103.